Node
type: Class
subclass of: Elements
comment: A node is one of the core elements in the OpenStreetMap data model. It consists of a single point in space defined by its latitude, longitude and node id.